[Date Prev][Date Next][Thread Prev][Thread Next][Date Index][Thread Index]

[Condor-users] problem building condor version 7.7.2 with Quill

I am trying to build Condor with Quill, using the latest development version 7.7.2

for "Red Hat Enterprise Linux Server release 5.5 (Tikanga)"

and I have problem.

Here is what I was trying to do:

onfiguring done
-- Generating done
-- Build files have been written to: /var/tmp/condor-7.7.2
-bash-3.2$ make
Scanning dependencies of target classad
[ 36%] Building CXX object src/condor_utils/CMakeFiles/utils.dir/credential.unix.cpp.o [ 36%] Building CXX object src/condor_utils/CMakeFiles/utils.dir/file_lock.cpp.o /var/tmp/condor-7.7.2/src/condor_utils/file_lock.cpp: In member function ‘virtual bool FileLock::obtain(LOCK_TYPE)’: /var/tmp/condor-7.7.2/src/condor_utils/file_lock.cpp:516: warning: ‘saved_errno’ may be used uninitialized in this function [ 36%] Building CXX object src/condor_utils/CMakeFiles/utils.dir/file_transfer_db.cpp.o /var/tmp/condor-7.7.2/src/condor_utils/file_transfer_db.cpp: In function ‘void file_transfer_db(file_transfer_record*, compat_classad::ClassAd*)’: /var/tmp/condor-7.7.2/src/condor_utils/file_transfer_db.cpp:93: error: ‘my_full_hostname’ was not declared in this scope make[2]: *** [src/condor_utils/CMakeFiles/utils.dir/file_transfer_db.cpp.o] Error 1
make[1]: *** [src/condor_utils/CMakeFiles/utils.dir/all] Error 2
make: *** [all] Error 2

Could any one point me at my mistake or suggest a way around? (Including an explanation why I should not use Quill :) )

I appreciate any help.