[Date Prev][Date Next][Thread Prev][Thread Next][Date Index][Thread Index]

Re: [Condor-users] recommended version of GCC for Slackware 12

hi Rob,
i tried ./configure --disable-full-port --disable-gcc-version-check
when is blahp turn, i'm getting the message (after install automake-1.6.3):

blahp-1.7.0-p2: FAILED! (see /home/dannemann/condor-7.2.1/externals/build/log.blahp-1.7.0-p2)
checking for main in -lpthread... yes
checking for ANSI C header files... (cached) yes
checking for sys/wait.h that is POSIX.1 compatible... yes
checking sys/time.h usability... yes
checking sys/time.h presence... yes
checking for sys/time.h... yes
checking syslog.h usability... yes
checking syslog.h presence... yes
checking for syslog.h... yes
checking for an ANSI C-conforming const... yes
checking for pid_t... yes
checking whether time.h and sys/time.h may both be included... yes
checking for select... yes
checking for socket... yes
checking for strdup... yes
checking for strerror... yes
checking for bsearch... yes
checking for vsnprintf... yes
GLITE_LOCATION set to /opt/glite
checking for CLASSAD installation... prefix: /home/dannemann/condor-7.2.1/externals/install/classads-1.0.2
checking if a small classads program compiles... no
configure: WARNING:
            ***  Cannot compile a small classads program: check whether the
            ***  Condor ClassADs library is installed
"GLOBUS nothread flavor is gcc32dbg"
"GLOBUS thread flavor is gcc32dbgpthr"
checking for /home/dannemann/condor-7.2.1/externals/install/globus-4.2.0/include/gcc32dbg/openssl/ssl.h... no
checking for openssl nothr... checking for /home/dannemann/condor-7.2.1/externals/install/globus-4.2.0/include/gcc32dbgpthr/openssl/ssl.h... no
checking checking openssl thr... checking for /home/dannemann/condor-7.2.1/externals/install/globus-4.2.0/include/gcc32dbgpthr/lber.h... no
checking for ldap thr... "CLASSADS found no"
"GLOBUS found no"
configure: creating ./config.status
config.status: creating Makefile
config.status: creating config/Makefile
config.status: creating src/Makefile
config.status: creating src/scripts/Makefile
config.status: executing depfiles commands
make[1]: Entering directory `/home/dannemann/condor-7.2.1/externals/build/blahp-1.7.0-p2/org.glite.ce.blahp'
cd . && /bin/sh /home/dannemann/condor-7.2.1/externals/build/blahp-1.7.0-p2/org.glite.ce.blahp/project/missing --run aclocal-1.6 -I project
cd . && \
          /bin/sh /home/dannemann/condor-7.2.1/externals/build/blahp-1.7.0-p2/org.glite.ce.blahp/project/missing --run automake-1.6 --foreign  Makefile
cd . && /bin/sh /home/dannemann/condor-7.2.1/externals/build/blahp-1.7.0-p2/org.glite.ce.blahp/project/missing --run autoconf
configure.ac:112: error: possibly undefined macro: AC_PROG_LIBTOOL
      If this token and others are legitimate, please use m4_pattern_allow.
      See the Autoconf documentation.
make[1]: *** [configure] Error 1
make[1]: Leaving directory `/home/dannemann/condor-7.2.1/externals/build/blahp-1.7.0-p2/org.glite.ce.blahp'
ERROR: build_blahp-1.7.0-p2 returned: 2
ERROR: unable to build blahp-1.7.0-p2
ERROR: aborting
make: *** [/home/dannemann/condor-7.2.1/externals/triggers/blahp-1.7.0-p2] Error 1

do you know whats happening?